Reaction Details
TargetProto-oncogene tyrosine-protein kinase receptor Ret
LigandBDBM50065312
Substrate/Competitorn/a
Meas. Tech.ChEMBL_610305 (CHEMBL1071417)
IC50 100000±n/a nM
Citation Mologni, LRostagno, RBrussolo, SKnowles, PPKjaer, SMurray-Rust, JRosso, EZambon, AScapozza, LMcDonald, NQLucchini, VGambacorti-Passerini, C Synthesis, structure-activity relationship and crystallographic studies of 3-substituted indolin-2-one RET inhibitors. Bioorg Med Chem18:1482-96 (2010) 
 
Proto-oncogene tyrosine-protein kinase receptor Ret
Name:Proto-oncogene tyrosine-protein kinase receptor Ret
Type:Protein
Mol. Mass.:124318.29
Organism:Homo sapiens (Human)
Description:P07949
Residue:1114
BDBM50065312
NameBDBM50065312
Synonyms:(Z)-4-methyl-3-(4-morpholinobenzylidene)indolin-2-one 4-Methyl-3-[1-(4-morpholin-4-yl-phenyl)-meth-(Z)-ylidene]-1,3-dihydro-indol-2-one | CHEMBL90277
TypeSmall organic molecule
Emp. Form.C20H20N2O2
Mol. Mass.320.385
SMILESCc1cccc2NC(=O)\C(=C/c3ccc(cc3)N3CCOCC3)c12