Reaction Details
TargetGalanin receptor type 1
LigandBDBM50307254
Substrate/Competitorn/a
Meas. Tech.ChEMBL_610344 (CHEMBL1072076)
Ki 0.100000±n/a nM
Citation Robertson, CRScholl, EAPruess, THGreen, BRWhite, HSBulaj, G Engineering galanin analogues that discriminate between GalR1 and GalR2 receptor subtypes and exhibit anticonvulsant activity following systemic delivery. J Med Chem53:1871-5 (2010) 
 
Galanin receptor type 1
Name:Galanin receptor type 1
Type:Enzyme Catalytic Domain
Mol. Mass.:38976.60
Organism:Homo sapiens (Human)
Description:Galanin R1 GALR1 HUMAN::P47211
Residue:349
BDBM50307254
NameBDBM50307254
Synonyms:CHEMBL604990 M40
TypeSmall organic molecule
Emp. Form.C94H145N23O24
Mol. Mass.1981.2968
SMILESCC(C)C[C@H](NC(=O)[C@H](CC(C)C)NC(=O)[C@H](Cc1ccc(O)cc1)NC(=O)CNC(=O)[C@H](C)NC(=O)[C@H](CO)NC(=O)[C@H](CC(N)=O)NC(=O)[C@H](CC(C)C)NC(=O)[C@@H](NC(=O)[C@H](Cc1c[nH]c2ccccc12)NC(=O)CN)[C@@H](C)O)C(=O)NCC(=O)N1CCC[C@H]1C(=O)N1CCC[C@H]1C(=O)N1CCC[C@H]1C(=O)N[C@@H](C)C(=O)N[C@@H](CC(C)C)C(=O)N[C@@H](C)C(=O)N[C@@H](CC(C)C)C(=O)N[C@@H](C)C(N)=O