Reaction Details
TargetGalanin receptor type 2
LigandBDBM50273360
Substrate/Competitorn/a
Meas. Tech.ChEMBL_610350 (CHEMBL1072082)
Ki 18±n/a nM
Citation Robertson, CRScholl, EAPruess, THGreen, BRWhite, HSBulaj, G Engineering galanin analogues that discriminate between GalR1 and GalR2 receptor subtypes and exhibit anticonvulsant activity following systemic delivery. J Med Chem53:1871-5 (2010) 
 
Galanin receptor type 2
Name:Galanin receptor type 2
Type:Enzyme Catalytic Domain
Mol. Mass.:41724.40
Organism:Homo sapiens (Human)
Description:Galanin R2 GALR2 HUMAN::O43603
Residue:387
BDBM50273360
NameBDBM50273360
Synonyms:(S)-N-((S)-6-amino-1-((S)-6-amino-1-((S)-1-((S)-1,6-diamino-1-oxohexan-2-ylamino)-1-oxo-6-palmitamidohexan-2-ylamino)-1-oxohexan-2-ylamino)-1-oxohexan-2-yl)-1-(2-((S)-2-((S)-2-((S)-2-(2-((S)-2-((S)-2-((S)-4-amino-2-((S)-2-((2S,3R)-2-((S)-2-(2-aminoacetamido)-3-(1H-indol-3-yl)propanamido)-3-hydroxybutanamido)-4-methylpentanamido)-4-oxobutanamido)-3-hydroxypropanamido)propanamido)acetamido)-3-(4-hydroxyphenyl)propanamido)-4-methylpentanamido)-4-methylpentanamido)acetyl)pyrrolidine-2-carboxamide [Sar1Gly]GAL-B2
TypeSmall organic molecule
Emp. Form.C103H172N24O22
Mol. Mass.2098.6154
(=O)NCCCC[C@H](NC(=O)[C@H](CCCCN)NC(=O)[C@H](CCCCN)NC(=O)[C@@H]1CCCN1C(=O)CNC(=O)[C@H](CC(C)C)NC(=O)[C@H](CC(C)C)NC(=O)[C@H](Cc1ccc(O)cc1)NC(=O)CNC(=O)[C@H](C)NC(=O)[C@H](CO)NC(=O)[C@H](CC(N)=O)NC(=O)[C@H](CC(C)C)NC(=O)[C@@H](NC(=O)[C@H](Cc1c[nH]c2ccccc12)NC(=O)CN)[C@@H](C)O)C(=O)N[C@@H](CCCCN)C(N)=O