Reaction Details
TargetGalanin receptor type 1
LigandBDBM50423646
Substrate/Competitorn/a
Meas. Tech.ChEMBL_610349 (CHEMBL1072081)
Ki 11700±n/a nM
Citation Robertson, CRScholl, EAPruess, THGreen, BRWhite, HSBulaj, G Engineering galanin analogues that discriminate between GalR1 and GalR2 receptor subtypes and exhibit anticonvulsant activity following systemic delivery. J Med Chem53:1871-5 (2010) 
 
Galanin receptor type 1
Name:Galanin receptor type 1
Type:Enzyme Catalytic Domain
Mol. Mass.:38976.60
Organism:Homo sapiens (Human)
Description:Galanin R1 GALR1 HUMAN::P47211
Residue:349
BDBM50423646
NameBDBM50423646
Synonyms:CHEMBL2309599 | Galnon
TypeSmall organic molecule
Emp. Form.C40H46N4O6
Mol. Mass.678.8164
SMILESCc1cc(=O)oc2cc(NC(=O)[C@@H](CCCCN)NC(=O)[C@H](CC3CCCCC3)NC(=O)OCC3c4ccccc4-c4ccccc34)ccc12