Reaction Details
TargetAmine oxidase [flavin-containing] B
LigandBDBM50307362
Substrate/Competitorn/a
Meas. Tech.ChEMBL_610658 (CHEMBL1071678)
Ki 38±n/a nM
Citation Lühr, SVilches-Herrera, MFierro, ARamsay, RREdmondson, DEReyes-Parada, MCassels, BKIturriaga-Vásquez, P 2-Arylthiomorpholine derivatives as potent and selective monoamine oxidase B inhibitors. Bioorg Med Chem18:1388-95 (2010) 
 
Amine oxidase [flavin-containing] B
Name:Amine oxidase [flavin-containing] B
Type:Protein
Mol. Mass.:58768.76
Organism:Homo sapiens (Human)
Description:P27338
Residue:520
BDBM50307362
NameBDBM50307362
Synonyms:(+/-)-2-(4'-Benzyloxyphenyl)thiomorpholine | CHEMBL597373
TypeSmall organic molecule
Emp. Form.C17H19NOS
Mol. Mass.285.404
SMILESC(Oc1ccc(cc1)C1CNCCS1)c1ccccc1