Reaction Details
TargetAmine oxidase [flavin-containing] B
LigandBDBM50307365
Substrate/Competitorn/a
Meas. Tech.ChEMBL_610656 (CHEMBL1071676)
Ki 3850±n/a nM
Citation Lühr, SVilches-Herrera, MFierro, ARamsay, RREdmondson, DEReyes-Parada, MCassels, BKIturriaga-Vásquez, P 2-Arylthiomorpholine derivatives as potent and selective monoamine oxidase B inhibitors. Bioorg Med Chem18:1388-95 (2010) 
 
Amine oxidase [flavin-containing] B
Name:Amine oxidase [flavin-containing] B
Type:Enzyme
Mol. Mass.:58469.65
Organism:Rattus norvegicus (rat)
Description:P19643
Residue:520
BDBM50307365
NameBDBM50307365
Synonyms:(+/-)-2-(4'-Methoxyphenyl)thiomorpholine | CHEMBL598395
TypeSmall organic molecule
Emp. Form.C11H15NOS
Mol. Mass.209.308
SMILESCOc1ccc(cc1)C1CNCCS1