Reaction Details
TargetAmine oxidase [flavin-containing] A
LigandBDBM50307367
Substrate/Competitorn/a
Meas. Tech.ChEMBL_610657 (CHEMBL1071677)
Ki 2500±n/a nM
Citation Lühr, SVilches-Herrera, MFierro, ARamsay, RREdmondson, DEReyes-Parada, MCassels, BKIturriaga-Vásquez, P 2-Arylthiomorpholine derivatives as potent and selective monoamine oxidase B inhibitors. Bioorg Med Chem18:1388-95 (2010) 
 
Amine oxidase [flavin-containing] A
Name:Amine oxidase [flavin-containing] A
Type:Protein
Mol. Mass.:59689.53
Organism:Homo sapiens (Human)
Description:P21397
Residue:527
BDBM50307367
NameBDBM50307367
Synonyms:(+/-)-2-(4'-Butoxyphenyl)thiomorpholine | CHEMBL597372
TypeSmall organic molecule
Emp. Form.C14H21NOS
Mol. Mass.251.388
SMILESCCCCOc1ccc(cc1)C1CNCCS1