Reaction Details
TargetFibroblast growth factor 2
LigandBDBM50307399
Substrate/Competitorn/a
Meas. Tech.ChEMBL_610686 (CHEMBL1072347)
Kd 129±n/a nM
Citation Johnstone, KDKaroli, TLiu, LDredge, KCopeman, ELi, CPDavis, KHammond, EBytheway, IKostewicz, EChiu, FCShackleford, DMCharman, SACharman, WNHarenberg, JGonda, TJFerro, V Synthesis and biological evaluation of polysulfated oligosaccharide glycosides as inhibitors of angiogenesis and tumor growth. J Med Chem53:1686-99 (2010) 
 
Fibroblast growth factor 2
Name:Fibroblast growth factor 2
Type:Protein
Mol. Mass.:30803.89
Organism:Homo sapiens (Human)
Description:P09038
Residue:288
BDBM50307399
NameBDBM50307399
Synonyms:Benzyl 2,3,4,6-Tetra-O-sulfo-alpha-D-mannopyranosyl-(1->3)-2,4,6-tri-O-sulfo-alpha-D-mannopyranosyl-(1->3)-2,4,6-tri-O-sulfo-alpha-D-mannopyranosyl-(1->2)-3,4,6-tri-O-sulfo-alpha-D-mannopyranoside, TridecasodiumSalt | CHEMBL589773
TypeSmall organic molecule
Emp. Form.C31H35O60S13
Mol. Mass.1784.426
SMILES[O-]S(=O)(=O)OC[C@H]1O[C@H](OCc2ccccc2)[C@@H](O[C@H]2O[C@H](COS([O-])(=O)=O)[C@@H](OS([O-])(=O)=O)[C@H](O[C@H]3O[C@H](COS([O-])(=O)=O)[C@@H](OS([O-])(=O)=O)[C@H](O[C@H]4O[C@H](COS([O-])(=O)=O)[C@@H](OS([O-])(=O)=O)[C@H](OS([O-])(=O)=O)[C@@H]4OS([O-])(=O)=O)[C@@H]3OS([O-])(=O)=O)[C@@H]2OS([O-])(=O)=O)[C@@H](OS([O-])(=O)=O)[C@@H]1OS([O-])(=O)=O