Reaction Details
TargetFibroblast growth factor 2
LigandBDBM50307400
Substrate/Competitorn/a
Meas. Tech.ChEMBL_610686 (CHEMBL1072347)
Kd 82±n/a nM
Citation Johnstone, KDKaroli, TLiu, LDredge, KCopeman, ELi, CPDavis, KHammond, EBytheway, IKostewicz, EChiu, FCShackleford, DMCharman, SACharman, WNHarenberg, JGonda, TJFerro, V Synthesis and biological evaluation of polysulfated oligosaccharide glycosides as inhibitors of angiogenesis and tumor growth. J Med Chem53:1686-99 (2010) 
 
Fibroblast growth factor 2
Name:Fibroblast growth factor 2
Type:Protein
Mol. Mass.:30803.89
Organism:Homo sapiens (Human)
Description:P09038
Residue:288
BDBM50307400
NameBDBM50307400
Synonyms:CHEMBL604366 | hexadecasodium [3-({4-[(4-{[3,5-bis(sulfonatooxy)-6-[(sulfonatooxy)methyl]-4-{[3,4,5-tris(sulfonatooxy)-6-[(sulfonatooxy)methyl]oxan-2-yl]oxy}oxan-2-yl]oxy}-3,5-bis(sulfonatooxy)-6-[(sulfonatooxy)methyl]oxan-2-yl)oxy]-3,5-bis(sulfonatooxy)-6-[(sulfonatooxy)methyl]oxan-2-yl}oxy)-2-(octyloxy)-5-(sulfonatooxy)-6-[(sulfonatooxy)methyl]oxan-4-yl] sulfate
TypeSmall organic molecule
Emp. Form.C38H52O74S16
Mol. Mass.2205.824
SMILESCCCCCCCCO[C@H]1O[C@H](COS([O-])(=O)=O)[C@@H](OS([O-])(=O)=O)[C@H](OS([O-])(=O)=O)[C@@H]1O[C@H]1O[C@H](COS([O-])(=O)=O)[C@@H](OS([O-])(=O)=O)[C@H](O[C@H]2O[C@H](COS([O-])(=O)=O)[C@@H](OS([O-])(=O)=O)[C@H](O[C@H]3O[C@H](COS([O-])(=O)=O)[C@@H](OS([O-])(=O)=O)[C@H](O[C@H]4O[C@H](COS([O-])(=O)=O)[C@@H](OS([O-])(=O)=O)[C@H](OS([O-])(=O)=O)[C@@H]4OS([O-])(=O)=O)[C@@H]3OS([O-])(=O)=O)[C@@H]2OS([O-])(=O)=O)[C@@H]1OS([O-])(=O)=O