Reaction Details
Target5-hydroxytryptamine receptor 3A
LigandBDBM50307816
Substrate/Competitorn/a
Meas. Tech.ChEMBL_612614 (CHEMBL1065651)
Ki 26.3±n/a nM
Citation Vernekar, SKHallaq, HYClarkson, GThompson, AJSilvestri, LLummis, SCLochner, M Toward biophysical probes for the 5-HT3 receptor: structure-activity relationship study of granisetron derivatives. J Med Chem53:2324-8 (2010) 
 
5-hydroxytryptamine receptor 3A
Name:5-hydroxytryptamine receptor 3A
Type:Protein
Mol. Mass.:55283.27
Organism:Homo sapiens (Human)
Description:P46098
Residue:478
BDBM50307816
NameBDBM50307816
Synonyms:4-Methoxy-1-methyl-N-[(3-endo)-9-methyl-9-azabicyclo[3.3.1]non-3-yl]-1H-indazole-3-carboxamide | CHEMBL596952
TypeSmall organic molecule
Emp. Form.C19H26N4O2
Mol. Mass.342.4353
SMILESCOc1cccc2n(C)nc(C(=O)NC3C[C@@H]4CCC[C@@H](C3)N4C)c12