Reaction Details
Target5-hydroxytryptamine receptor 3A
LigandBDBM50307824
Substrate/Competitorn/a
Meas. Tech.ChEMBL_612614 (CHEMBL1065651)
Ki 0.67±n/a nM
Citation Vernekar, SKHallaq, HYClarkson, GThompson, AJSilvestri, LLummis, SCLochner, M Toward biophysical probes for the 5-HT3 receptor: structure-activity relationship study of granisetron derivatives. J Med Chem53:2324-8 (2010) 
 
5-hydroxytryptamine receptor 3A
Name:5-hydroxytryptamine receptor 3A
Type:Protein
Mol. Mass.:55283.27
Organism:Homo sapiens (Human)
Description:P46098
Residue:478
BDBM50307824
NameBDBM50307824
Synonyms:7-Hydroxy-1-methyl-N-[(3-endo)-9-methyl-9-azabicyclo[3.3.1]non-3-yl]-1H-indazole-3-carboxamide | CHEMBL599011
TypeSmall organic molecule
Emp. Form.C18H24N4O2
Mol. Mass.328.4088
SMILESCN1[C@H]2CCC[C@H]1CC(C2)NC(=O)c1nn(C)c2c(O)cccc12