Reaction Details
Target5'-nucleotidase
LigandBDBM50378648
Substrate/Competitorn/a
Meas. Tech.ChEMBL_612633 (CHEMBL1065670)
Ki 11300±n/a nM
Citation Baqi, YLee, SYIqbal, JRipphausen, PLehr, AScheiff, ABZimmermann, HBajorath, JMüller, CE Development of potent and selective inhibitors of ecto-5'-nucleotidase based on an anthraquinone scaffold. J Med Chem53:2076-86 (2010) 
 
5'-nucleotidase
Name:5'-nucleotidase
Type:Enzyme
Mol. Mass.:63971.44
Organism:Rattus norvegicus (Rat)
Description:P21588
Residue:576
BDBM50378648
NameBDBM50378648
Synonyms:CHEMBL599050
TypeSmall organic molecule
Emp. Form.C20H12BrN2O5S
Mol. Mass.472.289
SMILESNc1c(cc(Nc2ccc(Br)cc2)c2C(=O)c3ccccc3C(=O)c12)S([O-])(=O)=O