Reaction Details
Target5'-nucleotidase
LigandBDBM50268686
Substrate/Competitorn/a
Meas. Tech.ChEMBL_612633 (CHEMBL1065670)
Ki 3430±n/a nM
Citation Baqi, YLee, SYIqbal, JRipphausen, PLehr, AScheiff, ABZimmermann, HBajorath, JMüller, CE Development of potent and selective inhibitors of ecto-5'-nucleotidase based on an anthraquinone scaffold. J Med Chem53:2076-86 (2010) 
 
5'-nucleotidase
Name:5'-nucleotidase
Type:Enzyme
Mol. Mass.:63971.44
Organism:Rattus norvegicus (Rat)
Description:P21588
Residue:576
BDBM50268686
NameBDBM50268686
Synonyms:CHEMBL496022 sodium 1-amino-9,10-dioxo-4-(4-sulfophenylamino)-9,10-dihydroanthracene-2-sulfonate
TypeSmall organic molecule
Emp. Form.C20H12N2O8S2
Mol. Mass.472.449
SMILESNc1c2C(=O)c3ccccc3C(=O)c2c(Nc2ccc(cc2)S([O-])(=O)=O)cc1S([O-])(=O)=O