Reaction Details
Target5'-nucleotidase
LigandBDBM50307835
Substrate/Competitorn/a
Meas. Tech.ChEMBL_612633 (CHEMBL1065670)
Ki 260±n/a nM
Citation Baqi, YLee, SYIqbal, JRipphausen, PLehr, AScheiff, ABZimmermann, HBajorath, JMüller, CE Development of potent and selective inhibitors of ecto-5'-nucleotidase based on an anthraquinone scaffold. J Med Chem53:2076-86 (2010) 
 
5'-nucleotidase
Name:5'-nucleotidase
Type:Enzyme
Mol. Mass.:63971.44
Organism:Rattus norvegicus (Rat)
Description:P21588
Residue:576
BDBM50307835
NameBDBM50307835
Synonyms:CHEMBL590956 | Sodium 1-amino-4-[4-fluoro-2-carboxyphenylamino]-9,10-dioxo-9,10-dihydroanthracene-2-sulfonate
TypeSmall organic molecule
Emp. Form.C21H12FN2O7S
Mol. Mass.455.393
SMILESNc1c(cc(Nc2ccc(F)cc2C(O)=O)c2C(=O)c3ccccc3C(=O)c12)S([O-])(=O)=O