Reaction Details
Target5'-nucleotidase
LigandBDBM50378653
Substrate/Competitorn/a
Meas. Tech.ChEMBL_612633 (CHEMBL1065670)
Ki 6050±n/a nM
Citation Baqi, YLee, SYIqbal, JRipphausen, PLehr, AScheiff, ABZimmermann, HBajorath, JMüller, CE Development of potent and selective inhibitors of ecto-5'-nucleotidase based on an anthraquinone scaffold. J Med Chem53:2076-86 (2010) 
 
5'-nucleotidase
Name:5'-nucleotidase
Type:Enzyme
Mol. Mass.:63971.44
Organism:Rattus norvegicus (Rat)
Description:P21588
Residue:576
BDBM50378653
NameBDBM50378653
Synonyms:CHEMBL592447
TypeSmall organic molecule
Emp. Form.C24H14N2O8S2
Mol. Mass.522.508
SMILESNc1c2C(=O)c3ccccc3C(=O)c2c(Nc2cccc3cccc(c23)S([O-])(=O)=O)cc1S([O-])(=O)=O