Reaction Details
Target5'-nucleotidase
LigandBDBM50378654
Substrate/Competitorn/a
Meas. Tech.ChEMBL_612633 (CHEMBL1065670)
Ki 2740±n/a nM
Citation Baqi, YLee, SYIqbal, JRipphausen, PLehr, AScheiff, ABZimmermann, HBajorath, JMüller, CE Development of potent and selective inhibitors of ecto-5'-nucleotidase based on an anthraquinone scaffold. J Med Chem53:2076-86 (2010) 
 
5'-nucleotidase
Name:5'-nucleotidase
Type:Enzyme
Mol. Mass.:63971.44
Organism:Rattus norvegicus (Rat)
Description:P21588
Residue:576
BDBM50378654
NameBDBM50378654
Synonyms:CHEMBL592448
TypeSmall organic molecule
Emp. Form.C25H17N2O5S
Mol. Mass.457.478
SMILESCc1ccc2ccccc2c1Nc1cc(c(N)c2C(=O)c3ccccc3C(=O)c12)S([O-])(=O)=O