Reaction Details
TargetP2Y purinoceptor 6
LigandBDBM50227032
Substrate/Competitorn/a
Meas. Tech.ChEMBL_612835 (CHEMBL1067524)
IC50>10000±n/a nM
Citation Baqi, YLee, SYIqbal, JRipphausen, PLehr, AScheiff, ABZimmermann, HBajorath, JMüller, CE Development of potent and selective inhibitors of ecto-5'-nucleotidase based on an anthraquinone scaffold. J Med Chem53:2076-86 (2010) 
 
P2Y purinoceptor 6
Name:P2Y purinoceptor 6
Type:PROTEIN
Mol. Mass.:36704.21
Organism:Rattus norvegicus
Description:ChEMBL_805344
Residue:328
BDBM50227032
NameBDBM50227032
Synonyms:CHEMBL256057 sodium 1-amino-9,10-dioxo-4-(phenylamino)-9,10-dihydroanthracene-2-sulfonate
TypeSmall organic molecule
Emp. Form.C20H13N2O5S
Mol. Mass.393.393
SMILESNc1c2C(=O)c3ccccc3C(=O)c2c(Nc2ccccc2)cc1S([O-])(=O)=O