Reaction Details
TargetEctonucleoside triphosphate diphosphohydrolase 1
LigandBDBM50029031
Substrate/Competitorn/a
Meas. Tech.ChEMBL_612637 (CHEMBL1065674)
Ki 20000±n/a nM
Citation Baqi, YLee, SYIqbal, JRipphausen, PLehr, AScheiff, ABZimmermann, HBajorath, JMüller, CE Development of potent and selective inhibitors of ecto-5'-nucleotidase based on an anthraquinone scaffold. J Med Chem53:2076-86 (2010) 
 
Ectonucleoside triphosphate diphosphohydrolase 1
Name:Ectonucleoside triphosphate diphosphohydrolase 1
Type:PROTEIN
Mol. Mass.:57412.31
Organism:Rattus norvegicus
Description:ChEMBL_463990
Residue:511
BDBM50029031
NameBDBM50029031
Synonyms:1-Amino-4-{4-[4-chloro-6-(3-sulfo-phenylamino)-[1,3,5]triazin-2-ylamino]-3-sulfo-phenylamino}-9,10-dioxo-9,10-dihydro-anthracene-2-sulfonic acid1-Amino-4-{4-[4-chloro-6-(4-sulfo-phenylamino)-[1,3,5]triazin-2-ylamino]-3-sulfo-phenylamino}-9,10-dioxo-9,10-dihydro-anthracene-2-sulfonic acid CID44285648 cibacron blue (mixer, meta and para isomers
TypeSmall organic molecule
Emp. Form.C29H17ClN7O11S3
Mol. Mass.771.135
SMILESNc1c(cc(Nc2ccc(Nc3nc(Cl)nc(Nc4cccc(c4)S([O-])(=O)=O)n3)c(c2)S([O-])(=O)=O)c2C(=O)c3ccccc3C(=O)c12)S([O-])(=O)=O