Reaction Details
TargetEctonucleoside triphosphate diphosphohydrolase 1
LigandBDBM50268725
Substrate/Competitorn/a
Meas. Tech.ChEMBL_612638 (CHEMBL1065675)
Ki 10700±n/a nM
Citation Baqi, YLee, SYIqbal, JRipphausen, PLehr, AScheiff, ABZimmermann, HBajorath, JMüller, CE Development of potent and selective inhibitors of ecto-5'-nucleotidase based on an anthraquinone scaffold. J Med Chem53:2076-86 (2010) 
 
Ectonucleoside triphosphate diphosphohydrolase 1
Name:Ectonucleoside triphosphate diphosphohydrolase 1
Type:PROTEIN
Mol. Mass.:57962.31
Organism:Homo sapiens (Human)
Description:ChEMBL_612638
Residue:510
BDBM50268725
NameBDBM50268725
Synonyms:CHEMBL496030 | sodium 1-amino-4-(4-hydroxyphenylamino)-9,10-dioxo-9,10-dihydroanthracene-2-sulfonate
TypeSmall organic molecule
Emp. Form.C20H13N2O6S
Mol. Mass.409.393
SMILESNc1c(cc(Nc2ccc(O)cc2)c2C(=O)c3ccccc3C(=O)c12)S([O-])(=O)=O