Reaction Details
TargetEctonucleoside triphosphate diphosphohydrolase 2
LigandBDBM50307835
Substrate/Competitorn/a
Meas. Tech.ChEMBL_612640 (CHEMBL1065677)
Ki>200000±n/a nM
Citation Baqi, YLee, SYIqbal, JRipphausen, PLehr, AScheiff, ABZimmermann, HBajorath, JMüller, CE Development of potent and selective inhibitors of ecto-5'-nucleotidase based on an anthraquinone scaffold. J Med Chem53:2076-86 (2010) 
 
Ectonucleoside triphosphate diphosphohydrolase 2
Name:Ectonucleoside triphosphate diphosphohydrolase 2
Type:PROTEIN
Mol. Mass.:53675.44
Organism:Homo sapiens (Human)
Description:ChEMBL_1453714
Residue:495
BDBM50307835
NameBDBM50307835
Synonyms:CHEMBL590956 | Sodium 1-amino-4-[4-fluoro-2-carboxyphenylamino]-9,10-dioxo-9,10-dihydroanthracene-2-sulfonate
TypeSmall organic molecule
Emp. Form.C21H12FN2O7S
Mol. Mass.455.393
SMILESNc1c(cc(Nc2ccc(F)cc2C(O)=O)c2C(=O)c3ccccc3C(=O)c12)S([O-])(=O)=O