Reaction Details
TargetEctonucleoside triphosphate diphosphohydrolase 3
LigandBDBM50307836
Substrate/Competitorn/a
Meas. Tech.ChEMBL_612642 (CHEMBL1065679)
Ki>60000±n/a nM
Citation Baqi, YLee, SYIqbal, JRipphausen, PLehr, AScheiff, ABZimmermann, HBajorath, JMüller, CE Development of potent and selective inhibitors of ecto-5'-nucleotidase based on an anthraquinone scaffold. J Med Chem53:2076-86 (2010) 
 
Ectonucleoside triphosphate diphosphohydrolase 3
Name:Ectonucleoside triphosphate diphosphohydrolase 3
Type:PROTEIN
Mol. Mass.:59103.51
Organism:Homo sapiens (Human)
Description:ChEMBL_612642
Residue:529
BDBM50307836
NameBDBM50307836
Synonyms:CHEMBL608559 | Sodium 1-Amino-4-(2-anthracenylamino)-9,10-dioxo-9,10-dihydroanthracene-2-sulfonate
TypeSmall organic molecule
Emp. Form.C28H17N2O5S
Mol. Mass.493.511
SMILESNc1c2C(=O)c3ccccc3C(=O)c2c(Nc2ccc3cc4ccccc4cc3c2)cc1S([O-])(=O)=O