Reaction Details
TargetHigh affinity nerve growth factor receptor
LigandBDBM50378657
Substrate/Competitorn/a
Meas. Tech.ChEMBL_608426 (CHEMBL1064455)
IC50>10000±n/a nM
Citation Brasca, MGAlbanese, CAlzani, RAmici, RAvanzi, NBallinari, DBischoff, JBorghi, DCasale, ECroci, VFiorentini, FIsacchi, AMercurio, CNesi, MOrsini, PPastori, WPesenti, EPevarello, PRoussel, PVarasi, MVolpi, DVulpetti, ACiomei, M Optimization of 6,6-dimethyl pyrrolo[3,4-c]pyrazoles: Identification of PHA-793887, a potent CDK inhibitor suitable for intravenous dosing. Bioorg Med Chem18:1844-53 (2010) 
 
High affinity nerve growth factor receptor
Name:High affinity nerve growth factor receptor
Type:n/a
Mol. Mass.:87498.18
Organism:Homo sapiens (Human)
Description:P04629
Residue:796
BDBM50378657
NameBDBM50378657
Synonyms:CHEMBL1230607
TypeSmall organic molecule
Emp. Form.C19H31N5O2
Mol. Mass.361.4817
SMILESCC(C)CC(=O)Nc1[nH]nc2c1CN(C(=O)C1CCN(C)CC1)C2(C)C