Reaction Details
TargetSerine/threonine-protein kinase Nek6
LigandBDBM50307987
Substrate/Competitorn/a
Meas. Tech.ChEMBL_608413 (CHEMBL1064442)
IC50>10000±n/a nM
Citation Brasca, MGAlbanese, CAlzani, RAmici, RAvanzi, NBallinari, DBischoff, JBorghi, DCasale, ECroci, VFiorentini, FIsacchi, AMercurio, CNesi, MOrsini, PPastori, WPesenti, EPevarello, PRoussel, PVarasi, MVolpi, DVulpetti, ACiomei, M Optimization of 6,6-dimethyl pyrrolo[3,4-c]pyrazoles: Identification of PHA-793887, a potent CDK inhibitor suitable for intravenous dosing. Bioorg Med Chem18:1844-53 (2010) 
 
Serine/threonine-protein kinase Nek6
Name:Serine/threonine-protein kinase Nek6
Type:PROTEIN
Mol. Mass.:35724.53
Organism:Homo sapiens (Human)
Description:ChEMBL_1446777
Residue:313
BDBM50307987
NameBDBM50307987
Synonyms:CHEMBL604712 | N-[5-(2,2-Dimethylpropanoyl)-6,6-dimethyl-1,4,5,6-tetrahydropyrrolo[3,4-c]pyrazol-3-yl]-3,5-difluorobenzamide
TypeSmall organic molecule
Emp. Form.C19H22F2N4O2
Mol. Mass.376.4004
SMILESCC(C)(C)C(=O)N1Cc2c(NC(=O)c3cc(F)cc(F)c3)[nH]nc2C1(C)C