Reaction Details
Target5-hydroxytryptamine receptor 1A
LigandBDBM50308002
Substrate/Competitorn/a
Meas. Tech.ChEMBL_608746 (CHEMBL1067759)
Ki 90±n/a nM
Citation Neves, GMenegatti, RAntonio, CBGrazziottin, LRVieira, RORates, SMNoël, FBarreiro, EJFraga, CA Searching for multi-target antipsychotics: Discovery of orally active heterocyclic N-phenylpiperazine ligands of D2-like and 5-HT1A receptors. Bioorg Med Chem18:1925-35 (2010) 
 
5-hydroxytryptamine receptor 1A
Name:5-hydroxytryptamine receptor 1A
Type:G Protein-Coupled Receptor (GPCR)
Mol. Mass.:46445.29
Organism:Rattus norvegicus (rat)
Description:Binding assays were performed using rat hippocampal membranes.
Residue:422
BDBM50308002
NameBDBM50308002
Synonyms:1-[(1-(4-Chlorophenyl)-1H-pyrazol-4-yl)methyl]-4-phenylpiperazine | CHEMBL597601
TypeSmall organic molecule
Emp. Form.C20H21ClN4
Mol. Mass.352.861
SMILESClc1ccc(cc1)-n1cc(CN2CCN(CC2)c2ccccc2)cn1