Reaction Details
Target5-hydroxytryptamine receptor 1A
LigandBDBM50308006
Substrate/Competitorn/a
Meas. Tech.ChEMBL_608746 (CHEMBL1067759)
Ki 620±n/a nM
Citation Neves, GMenegatti, RAntonio, CBGrazziottin, LRVieira, RORates, SMNoël, FBarreiro, EJFraga, CA Searching for multi-target antipsychotics: Discovery of orally active heterocyclic N-phenylpiperazine ligands of D2-like and 5-HT1A receptors. Bioorg Med Chem18:1925-35 (2010) 
 
5-hydroxytryptamine receptor 1A
Name:5-hydroxytryptamine receptor 1A
Type:G Protein-Coupled Receptor (GPCR)
Mol. Mass.:46445.29
Organism:Rattus norvegicus (rat)
Description:Binding assays were performed using rat hippocampal membranes.
Residue:422
BDBM50308006
NameBDBM50308006
Synonyms:1-(4-Chlorophenyl)-4-{[1-(4-chlorophenyl)-1H-pyrazol-4-yl]methyl}piperazine | CHEMBL606400
TypeSmall organic molecule
Emp. Form.C20H20Cl2N4
Mol. Mass.387.306
SMILESClc1ccc(cc1)N1CCN(Cc2cnn(c2)-c2ccc(Cl)cc2)CC1