Reaction Details
Target5-hydroxytryptamine receptor 1A
LigandBDBM50308007
Substrate/Competitorn/a
Meas. Tech.ChEMBL_608746 (CHEMBL1067759)
Ki>4440±n/a nM
Citation Neves, GMenegatti, RAntonio, CBGrazziottin, LRVieira, RORates, SMNoël, FBarreiro, EJFraga, CA Searching for multi-target antipsychotics: Discovery of orally active heterocyclic N-phenylpiperazine ligands of D2-like and 5-HT1A receptors. Bioorg Med Chem18:1925-35 (2010) 
 
5-hydroxytryptamine receptor 1A
Name:5-hydroxytryptamine receptor 1A
Type:G Protein-Coupled Receptor (GPCR)
Mol. Mass.:46445.29
Organism:Rattus norvegicus (rat)
Description:Binding assays were performed using rat hippocampal membranes.
Residue:422
BDBM50308007
NameBDBM50308007
Synonyms:1-{[1-(4-Chlorophenyl)-1H-pyrazol-4-yl]methyl}-4-(4-methoxyphenyl)piperazine | CHEMBL599045
TypeSmall organic molecule
Emp. Form.C21H23ClN4O
Mol. Mass.382.887
SMILESCOc1ccc(cc1)N1CCN(Cc2cnn(c2)-c2ccc(Cl)cc2)CC1