Reaction Details
Target5-hydroxytryptamine receptor 1A
LigandBDBM50308009
Substrate/Competitorn/a
Meas. Tech.ChEMBL_608746 (CHEMBL1067759)
Ki 4250±n/a nM
Citation Neves, GMenegatti, RAntonio, CBGrazziottin, LRVieira, RORates, SMNoël, FBarreiro, EJFraga, CA Searching for multi-target antipsychotics: Discovery of orally active heterocyclic N-phenylpiperazine ligands of D2-like and 5-HT1A receptors. Bioorg Med Chem18:1925-35 (2010) 
 
5-hydroxytryptamine receptor 1A
Name:5-hydroxytryptamine receptor 1A
Type:G Protein-Coupled Receptor (GPCR)
Mol. Mass.:46445.29
Organism:Rattus norvegicus (rat)
Description:Binding assays were performed using rat hippocampal membranes.
Residue:422
BDBM50308009
NameBDBM50308009
Synonyms:1-(4-Chlorophenyl)-4-[(1-phenyl-1H-1,2,3-triazol-4-yl)methyl]piperazine | CHEMBL598222
TypeSmall organic molecule
Emp. Form.C19H20ClN5
Mol. Mass.353.849
SMILESClc1ccc(cc1)N1CCN(Cc2cn(nn2)-c2ccccc2)CC1