Reaction Details
Target5-hydroxytryptamine receptor 1A
LigandBDBM50308017
Substrate/Competitorn/a
Meas. Tech.ChEMBL_608746 (CHEMBL1067759)
Ki 4210±n/a nM
Citation Neves, GMenegatti, RAntonio, CBGrazziottin, LRVieira, RORates, SMNoël, FBarreiro, EJFraga, CA Searching for multi-target antipsychotics: Discovery of orally active heterocyclic N-phenylpiperazine ligands of D2-like and 5-HT1A receptors. Bioorg Med Chem18:1925-35 (2010) 
 
5-hydroxytryptamine receptor 1A
Name:5-hydroxytryptamine receptor 1A
Type:G Protein-Coupled Receptor (GPCR)
Mol. Mass.:46445.29
Organism:Rattus norvegicus (rat)
Description:Binding assays were performed using rat hippocampal membranes.
Residue:422
BDBM50308017
NameBDBM50308017
Synonyms:2-Methyl-3-(4-phenylpiperazinylmethyl)imidazo[1,2-a]-pyridine | CHEMBL597006
TypeSmall organic molecule
Emp. Form.C19H22N4
Mol. Mass.306.4048
SMILESCc1nc2ccccn2c1CN1CCN(CC1)c1ccccc1