Reaction Details
Target5-hydroxytryptamine receptor 2A
LigandBDBM50184797
Substrate/Competitorn/a
Meas. Tech.ChEMBL_608747 (CHEMBL1067760)
Ki 1040±n/a nM
Citation Neves, GMenegatti, RAntonio, CBGrazziottin, LRVieira, RORates, SMNoël, FBarreiro, EJFraga, CA Searching for multi-target antipsychotics: Discovery of orally active heterocyclic N-phenylpiperazine ligands of D2-like and 5-HT1A receptors. Bioorg Med Chem18:1925-35 (2010) 
 
5-hydroxytryptamine receptor 2A
Name:5-hydroxytryptamine receptor 2A
Type:G Protein-Coupled Receptor (GPCR)
Mol. Mass.:52852.05
Organism:Rattus norvegicus (rat)
Description:Rat cortex membranes 5-HT2A receptors.
Residue:471
BDBM50184797
NameBDBM50184797
Synonyms:1-(4-Fluorophenyl)-4-[(1-phenyl-1H-pyrazol-4-yl)methyl]piperazine CHEMBL437490
TypeSmall organic molecule
Emp. Form.C20H21FN4
Mol. Mass.336.4059
SMILESFc1ccc(cc1)N1CCN(Cc2cnn(c2)-c2ccccc2)CC1