Reaction Details
Target5-hydroxytryptamine receptor 2A
LigandBDBM50308011
Substrate/Competitorn/a
Meas. Tech.ChEMBL_608747 (CHEMBL1067760)
Ki 4670±n/a nM
Citation Neves, GMenegatti, RAntonio, CBGrazziottin, LRVieira, RORates, SMNoël, FBarreiro, EJFraga, CA Searching for multi-target antipsychotics: Discovery of orally active heterocyclic N-phenylpiperazine ligands of D2-like and 5-HT1A receptors. Bioorg Med Chem18:1925-35 (2010) 
 
5-hydroxytryptamine receptor 2A
Name:5-hydroxytryptamine receptor 2A
Type:G Protein-Coupled Receptor (GPCR)
Mol. Mass.:52852.05
Organism:Rattus norvegicus (rat)
Description:Rat cortex membranes 5-HT2A receptors.
Residue:471
BDBM50308011
NameBDBM50308011
Synonyms:1-(4-Fluorophenyl)-4-{[1-(4-fluorophenyl)-1H-1,2,3-triazol-4-yl]methyl}piperazine | CHEMBL604916
TypeSmall organic molecule
Emp. Form.C19H19F2N5
Mol. Mass.355.3845
SMILESFc1ccc(cc1)N1CCN(Cc2cn(nn2)-c2ccc(F)cc2)CC1