Reaction Details
TargetMacrophage colony-stimulating factor 1 receptor
LigandBDBM4814
Substrate/Competitorn/a
Meas. Tech.ChEMBL_609722 (CHEMBL1067459)
IC50 155±n/a nM
Citation Mashkani, BGriffith, RAshman, LK Colony stimulating factor-1 receptor as a target for small molecule inhibitors. Bioorg Med Chem18:1789-97 (2010) 
 
Macrophage colony-stimulating factor 1 receptor
Name:Macrophage colony-stimulating factor 1 receptor
Type:Protein
Mol. Mass.:107979.48
Organism:Homo sapiens (Human)
Description:P07333
Residue:972
BDBM4814
NameBDBM4814
Synonyms:CHEMBL535 N-[2-(diethylamino)ethyl]-5-{[(3Z)-5-fluoro-2-oxo-2,3-dihydro-1H-indol-3-ylidene]methyl}-2,4-dimethyl-1H-pyrrole-3-carboxamide SUNITINIB US10464902, Sunitinib US9914707, SU11248
TypeSmall organic molecule
Emp. Form.C22H27FN4O2
Mol. Mass.398.4738
SMILESCCN(CC)CCNC(=O)c1c(C)[nH]c(\C=C2/C(=O)Nc3ccc(F)cc23)c1C