Reaction Details
TargetSerine/threonine-protein kinase mTOR
LigandBDBM50308156
Substrate/Competitorn/a
Meas. Tech.ChEMBL_611077 (CHEMBL1065057)
IC50 0.5±n/a nM
Citation Venkatesan, AMDehnhardt, CMDelos Santos, EChen, ZDos Santos, OAyral-Kaloustian, SKhafizova, GBrooijmans, NMallon, RHollander, IFeldberg, LLucas, JYu, KGibbons, JAbraham, RTChaudhary, IMansour, TS Bis(morpholino-1,3,5-triazine) derivatives: potent adenosine 5'-triphosphate competitive phosphatidylinositol-3-kinase/mammalian target of rapamycin inhibitors: discovery of compound 26 (PKI-587), a highly efficacious dual inhibitor. J Med Chem53:2636-45 (2010) 
 
Serine/threonine-protein kinase mTOR
Name:Serine/threonine-protein kinase mTOR
Type:Rapamycin target protein
Mol. Mass.:288917.12
Organism:Homo sapiens (Human)
Description:P42345
Residue:2549
BDBM50308156
NameBDBM50308156
Synonyms:CHEMBL592615 | N-[2-(Dimethylamino)ethyl]-4-({[4-(4,6-dimorpholin-4-yl-1,3,5-triazin-2-yl)phenyl]carbamoyl}aminobenzamide
TypeSmall organic molecule
Emp. Form.C29H37N9O4
Mol. Mass.575.662
SMILESCN(C)CCNC(=O)c1ccc(NC(=O)Nc2ccc(cc2)-c2nc(nc(n2)N2CCOCC2)N2CCOCC2)cc1