Reaction Details
TargetPhosphatidylinositol 4,5-bisphosphate 3-kinase catalytic subunit alpha isoform
LigandBDBM50308136
Substrate/Competitorn/a
Meas. Tech.ChEMBL_611075 (CHEMBL1065055)
IC50 0.7±n/a nM
Citation Venkatesan, AMDehnhardt, CMDelos Santos, EChen, ZDos Santos, OAyral-Kaloustian, SKhafizova, GBrooijmans, NMallon, RHollander, IFeldberg, LLucas, JYu, KGibbons, JAbraham, RTChaudhary, IMansour, TS Bis(morpholino-1,3,5-triazine) derivatives: potent adenosine 5'-triphosphate competitive phosphatidylinositol-3-kinase/mammalian target of rapamycin inhibitors: discovery of compound 26 (PKI-587), a highly efficacious dual inhibitor. J Med Chem53:2636-45 (2010) 
 
Phosphatidylinositol 4,5-bisphosphate 3-kinase catalytic subunit alpha isoform
Name:Phosphatidylinositol 4,5-bisphosphate 3-kinase catalytic subunit alpha isoform
Type:Enzyme Subunit
Mol. Mass.:124294.87
Organism:Homo sapiens (Human)
Description:P42336
Residue:1068
BDBM50308136
NameBDBM50308136
Synonyms:1-[4-(4,6-Dimorpholin-4-yl-1,3,5-triazin-2-yl)-phenyl]-3-{4-[(4-pyrrolidin-1-ylpiperidin-1-yl)carbonyl]phenyl}-urea | CHEMBL592461
TypeSmall organic molecule
Emp. Form.C34H43N9O4
Mol. Mass.641.7631
SMILESO=C(Nc1ccc(cc1)C(=O)N1CCC(CC1)N1CCCC1)Nc1ccc(cc1)-c1nc(nc(n1)N1CCOCC1)N1CCOCC1