Reaction Details
TargetAlpha-glucosidase MAL12
LigandBDBM50308256
Substrate/Competitorn/a
Meas. Tech.ChEMBL_613790 (CHEMBL1069561)
IC50 3800±n/a nM
Citation Ferreira, SBSodero, ACCardoso, MFLima, ESKaiser, CRSilva, FPFerreira, VF Synthesis, biological activity, and molecular modeling studies of 1H-1,2,3-triazole derivatives of carbohydrates as alpha-glucosidases inhibitors. J Med Chem53:2364-75 (2010) 
 
Alpha-glucosidase MAL12
Name:Alpha-glucosidase MAL12
Type:Protein
Mol. Mass.:68084.32
Organism:Saccharomyces cerevisiae
Description:P53341
Residue:584
BDBM50308256
NameBDBM50308256
Synonyms:1-O-Methyl-2,3-O-isopropylidene-5-(4-cyclohexene-1H-1,2,3-triazol-1-yl)-beta-D-ribofuranose | CHEMBL598823
TypeSmall organic molecule
Emp. Form.C17H25N3O4
Mol. Mass.335.3981
SMILESCO[C@@H]1O[C@H](Cn2cc(nn2)C2=CCCCC2)[C@H]2OC(C)(C)O[C@@H]12