Reaction Details
TargetCarbonic anhydrase 4
LigandBDBM50085536
Substrate/Competitorn/a
Meas. Tech.ChEMBL_613331 (CHEMBL1074268)
Ki 9800±n/a nM
Citation Innocenti, ABeyza Oztürk Sarikaya, SGülçin, ISupuran, CT Carbonic anhydrase inhibitors. Inhibition of mammalian isoforms I-XIV with a series of natural product polyphenols and phenolic acids. Bioorg Med Chem18:2159-64 (2010) 
 
Carbonic anhydrase 4
Name:Carbonic anhydrase 4
Type:Enzyme
Mol. Mass.:35037.98
Organism:Homo sapiens (Human)
Description:P22748
Residue:312
BDBM50085536
NameBDBM50085536
Synonyms:3,4,5-Trihydroxybenzoate, X CHEMBL288114 gallic acid
TypeSmall organic molecule
Emp. Form.C7H6O5
Mol. Mass.170.1195
SMILESOC(=O)c1cc(O)c(O)c(O)c1