Reaction Details
TargetCarbonic anhydrase 5B, mitochondrial
LigandBDBM50214744
Substrate/Competitorn/a
Meas. Tech.ChEMBL_613333 (CHEMBL1074270)
Ki 10500±n/a nM
Citation Innocenti, ABeyza Oztürk Sarikaya, SGülçin, ISupuran, CT Carbonic anhydrase inhibitors. Inhibition of mammalian isoforms I-XIV with a series of natural product polyphenols and phenolic acids. Bioorg Med Chem18:2159-64 (2010) 
 
Carbonic anhydrase 5B, mitochondrial
Name:Carbonic anhydrase 5B, mitochondrial
Type:Enzyme
Mol. Mass.:36440.83
Organism:Homo sapiens (Human)
Description:Human (cloned) isozyme
Residue:317
BDBM50214744
NameBDBM50214744
Synonyms:(2E)-3-(4-hydroxy-3-methoxyphenyl)prop-2-enoic acid CHEMBL32749 ferulic acid
TypeSmall organic molecule
Emp. Form.C10H10O4
Mol. Mass.194.184
SMILESCOc1cc(\C=C\C(O)=O)ccc1O