Reaction Details
TargetCarbonic anhydrase 9
LigandBDBM4375
Substrate/Competitorn/a
Meas. Tech.ChEMBL_613336 (CHEMBL1074273)
Ki 7870±n/a nM
Citation Innocenti, ABeyza Oztürk Sarikaya, SGülçin, ISupuran, CT Carbonic anhydrase inhibitors. Inhibition of mammalian isoforms I-XIV with a series of natural product polyphenols and phenolic acids. Bioorg Med Chem18:2159-64 (2010) 
 
Carbonic anhydrase 9
Name:Carbonic anhydrase 9
Type:Enzyme
Mol. Mass.:49669.03
Organism:Homo sapiens (Human)
Description:Catalytic domain of human cloned isozyme was used in the assay
Residue:459
BDBM4375
NameBDBM4375
Synonyms:(2E)-3-(3,4-dihydroxyphenyl)prop-2-enoic acid 3,4-Dihydroxycinnamate, XVII Caffeic acid cid_689043
TypeSmall organic molecule
Emp. Form.C9H8O4
Mol. Mass.180.1574
SMILESOC(=O)\C=C\c1ccc(O)c(O)c1