Reaction Details
TargetCarbonic anhydrase 4
LigandBDBM4375
Substrate/Competitorn/a
Meas. Tech.ChEMBL_613331 (CHEMBL1074268)
Ki 10100±n/a nM
Citation Innocenti, ABeyza Oztürk Sarikaya, SGülçin, ISupuran, CT Carbonic anhydrase inhibitors. Inhibition of mammalian isoforms I-XIV with a series of natural product polyphenols and phenolic acids. Bioorg Med Chem18:2159-64 (2010) 
 
Carbonic anhydrase 4
Name:Carbonic anhydrase 4
Type:Enzyme
Mol. Mass.:35037.98
Organism:Homo sapiens (Human)
Description:P22748
Residue:312
BDBM4375
NameBDBM4375
Synonyms:(2E)-3-(3,4-dihydroxyphenyl)prop-2-enoic acid 3,4-Dihydroxycinnamate, XVII Caffeic acid cid_689043
TypeSmall organic molecule
Emp. Form.C9H8O4
Mol. Mass.180.1574
SMILESOC(=O)\C=C\c1ccc(O)c(O)c1