Reaction Details
TargetAdenosine receptor A1
LigandBDBM50079652
Substrate/Competitorn/a
Meas. Tech.ChEMBL_613366 (CHEMBL1068173)
Ki 0.550000±n/a nM
Citation Scheiff, ABYerande, SGEl-Tayeb, ALi, WInamdar, GSVasu, KKSudarsanam, VMüller, CE 2-Amino-5-benzoyl-4-phenylthiazoles: Development of potent and selective adenosine A1 receptor antagonists. Bioorg Med Chem18:2195-203 (2010) 
 
Adenosine receptor A1
Name:Adenosine receptor A1
Type:PROTEIN
Mol. Mass.:36646.06
Organism:Mus musculus
Description:ChEMBL_479902
Residue:326
BDBM50079652
NameBDBM50079652
Synonyms:(E)-1-[(R)-2-(2-Hydroxy-ethyl)-piperidin-1-yl]-3-(2-phenyl-pyrazolo[1,5-a]pyridin-3-yl)-propenone 1-[2-(2-Hydroxy-ethyl)-piperidin-1-yl]-3-(2-phenyl-pyrazolo[1,5-a]pyridin-3-yl)-propenone FK-453
TypeSmall organic molecule
Emp. Form.C23H25N3O2
Mol. Mass.375.4635
SMILESOCC[C@H]1CCCCN1C(=O)\C=C\c1c(nn2ccccc12)-c1ccccc1