Reaction Details
TargetAdenosine receptor A1
LigandBDBM50308487
Substrate/Competitorn/a
Meas. Tech.ChEMBL_613342 (CHEMBL1074279)
Ki 5.8±n/a nM
Citation Scheiff, ABYerande, SGEl-Tayeb, ALi, WInamdar, GSVasu, KKSudarsanam, VMüller, CE 2-Amino-5-benzoyl-4-phenylthiazoles: Development of potent and selective adenosine A1 receptor antagonists. Bioorg Med Chem18:2195-203 (2010) 
 
Adenosine receptor A1
Name:Adenosine receptor A1
Type:Protein
Mol. Mass.:36704.13
Organism:Rattus norvegicus (rat)
Description:n/a
Residue:326
BDBM50308487
NameBDBM50308487
Synonyms:CHEMBL591710 | N-(5-Benzoyl-4-phenylthiazol-2-yl)furan-2-carboxamide
TypeSmall organic molecule
Emp. Form.C21H14N2O3S
Mol. Mass.374.412
SMILESO=C(Nc1nc(c(s1)C(=O)c1ccccc1)-c1ccccc1)c1ccco1