Reaction Details
TargetAdenosine receptor A1
LigandBDBM50079654
Substrate/Competitorn/a
Meas. Tech.ChEMBL_613366 (CHEMBL1068173)
Ki 10±n/a nM
Citation Scheiff, ABYerande, SGEl-Tayeb, ALi, WInamdar, GSVasu, KKSudarsanam, VMüller, CE 2-Amino-5-benzoyl-4-phenylthiazoles: Development of potent and selective adenosine A1 receptor antagonists. Bioorg Med Chem18:2195-203 (2010) 
 
Adenosine receptor A1
Name:Adenosine receptor A1
Type:PROTEIN
Mol. Mass.:36646.06
Organism:Mus musculus
Description:ChEMBL_479902
Residue:326
BDBM50079654
NameBDBM50079654
Synonyms:4-(6-oxo-3-(2-phenylpyrazolo[1,5-a]pyridin-3-yl)pyridazin-1(6H)-yl)butanoic acid CHEMBL292917
TypeSmall organic molecule
Emp. Form.C21H18N4O3
Mol. Mass.374.3926
SMILESOC(=O)CCCn1nc(ccc1=O)-c1c(nn2ccccc12)-c1ccccc1