Reaction Details
TargetAdenosine receptor A1
LigandBDBM50308507
Substrate/Competitorn/a
Meas. Tech.ChEMBL_613353 (CHEMBL1074290)
Ki 2.5±n/a nM
Citation Scheiff, ABYerande, SGEl-Tayeb, ALi, WInamdar, GSVasu, KKSudarsanam, VMüller, CE 2-Amino-5-benzoyl-4-phenylthiazoles: Development of potent and selective adenosine A1 receptor antagonists. Bioorg Med Chem18:2195-203 (2010) 
 
Adenosine receptor A1
Name:Adenosine receptor A1
Type:Protein
Mol. Mass.:36704.13
Organism:Rattus norvegicus (rat)
Description:n/a
Residue:326
BDBM50308507
NameBDBM50308507
Synonyms:4-(2-phenyl-7H-pyrrolo[2,3-d]pyrimidin-4-ylamino)cyclohexanol SLV-320
TypeSmall organic molecule
Emp. Form.C18H20N4O
Mol. Mass.308.3776
SMILESOC1CCC(CC1)Nc1nc(nc2[nH]ccc12)-c1ccccc1