Reaction Details
TargetProstaglandin G/H synthase 1
LigandBDBM50074933
Substrate/Competitorn/a
Meas. Tech.ChEMBL_613375 (CHEMBL1067573)
IC50 110±n/a nM
Citation Ehrman, TMBarlow, DJHylands, PJ In silico search for multi-target anti-inflammatories in Chinese herbs and formulas. Bioorg Med Chem18:2204-18 (2010) 
 
Prostaglandin G/H synthase 1
Name:Prostaglandin G/H synthase 1
Type:Protein
Mol. Mass.:68868.60
Organism:Ovis aries (Sheep)
Description:n/a
Residue:600
BDBM50074933
NameBDBM50074933
Synonyms:2-biphenyl-4-yl-propionic acid alpha-Methyl-4-biphenyl-acetic acid
TypeSmall organic molecule
Emp. Form.C15H14O2
Mol. Mass.226.2705
SMILESCC(C(O)=O)c1ccc(cc1)-c1ccccc1