Reaction Details
TargetcAMP-specific 3',5'-cyclic phosphodiesterase 4B
LigandBDBM14774
Substrate/Competitorn/a
Meas. Tech.ChEMBL_613379 (CHEMBL1067577)
IC50 0.84±n/a nM
Citation Ehrman, TMBarlow, DJHylands, PJ In silico search for multi-target anti-inflammatories in Chinese herbs and formulas. Bioorg Med Chem18:2204-18 (2010) 
 
cAMP-specific 3',5'-cyclic phosphodiesterase 4B
Name:cAMP-specific 3',5'-cyclic phosphodiesterase 4B
Type:Protein
Mol. Mass.:83318.87
Organism:Homo sapiens (Human)
Description:Q07343
Residue:736
BDBM14774
NameBDBM14774
Synonyms:3-(cyclopropylmethoxy)-N-(3,5-dichloropyridin-4-yl)-4-(difluoromethoxy)benzamide DAXAS Roflumilast
TypeSmall organic molecule
Emp. Form.C17H14Cl2F2N2O3
Mol. Mass.403.207
SMILESFC(F)Oc1ccc(cc1OCC1CC1)C(=O)Nc1c(Cl)cncc1Cl