Reaction Details
TargetcAMP-specific 3',5'-cyclic phosphodiesterase 4D
LigandBDBM14390
Substrate/Competitorn/a
Meas. Tech.ChEMBL_613378 (CHEMBL1067576)
IC50 20000±n/a nM
Citation Ehrman, TMBarlow, DJHylands, PJ In silico search for multi-target anti-inflammatories in Chinese herbs and formulas. Bioorg Med Chem18:2204-18 (2010) 
 
cAMP-specific 3',5'-cyclic phosphodiesterase 4D
Name:cAMP-specific 3',5'-cyclic phosphodiesterase 4D
Type:Protein
Mol. Mass.:91092.69
Organism:Homo sapiens (Human)
Description:Q08499
Residue:809
BDBM14390
NameBDBM14390
Synonyms:5-[2-ethoxy-5-(4-methyl-1-piperazinylsulfonyl)phenyl]-1-methyl-3-n-propyl-1,6-dihydro-7H-pyrazolo[4,3-d]pyrimidin-7-one CHEMBL192 Sildenafil US11155558, Compound sildenafil Viagra
TypeSmall organic molecule
Emp. Form.C22H30N6O4S
Mol. Mass.474.576
SMILESCCCc1nn(C)c2c1nc([nH]c2=O)-c1cc(ccc1OCC)S(=O)(=O)N1CCN(C)CC1