Reaction Details
TargetCystine/glutamate transporter
LigandBDBM50378666
Substrate/Competitorn/a
Meas. Tech.ChEMBL_607278 (CHEMBL1072820)
Ki 60000±n/a nM
Citation Patel, SARajale, TO'Brien, EBurkhart, DJNelson, JKTwamley, BBlumenfeld, ASzabon-Watola, MIGerdes, JMBridges, RJNatale, NR Isoxazole analogues bind the system xc- transporter: structure-activity relationship and pharmacophore model. Bioorg Med Chem18:202-13 (2010) 
 
Cystine/glutamate transporter
Name:Cystine/glutamate transporter
Type:PROTEIN
Mol. Mass.:55437.48
Organism:Homo sapiens (Human)
Description:ChEMBL_772170
Residue:501
BDBM50378666
NameBDBM50378666
Synonyms:CHEMBL601837
TypeSmall organic molecule
Emp. Form.C13H12N4O5
Mol. Mass.304.2582
SMILESCC(N=Nc1ccc(cc1)[N+]([O-])=O)c1c(C)onc1C(O)=O