Reaction Details
TargetRho-associated protein kinase 2
LigandBDBM50308867
Substrate/Competitorn/a
Meas. Tech.ChEMBL_607685 (CHEMBL1071707)
IC50 266000±n/a nM
Citation Morwick, TBüttner, FHCywin, CLDahmann, GHickey, EJakes, SKaplita, PKashem, MAKerr, SKugler, SMao, WMarshall, DPaw, ZShih, CKWu, FYoung, E Hit to lead account of the discovery of bisbenzamide and related ureidobenzamide inhibitors of Rho kinase. J Med Chem53:759-77 (2010) 
 
Rho-associated protein kinase 2
Name:Rho-associated protein kinase 2
Type:Protein
Mol. Mass.:160885.43
Organism:Homo sapiens (Human)
Description:O75116
Residue:1388
BDBM50308867
NameBDBM50308867
Synonyms:CHEMBL604249 | N-[3-(4-Dimethylaminomethyl-phenylcarbamoyl)-benzyl]-4-methoxy-3-methyl-benzamide
TypeSmall organic molecule
Emp. Form.C26H29N3O3
Mol. Mass.431.5268
SMILESCOc1ccc(cc1C)C(=O)NCc1cccc(c1)C(=O)Nc1ccc(CN(C)C)cc1