Reaction Details
TargetRho-associated protein kinase 1
LigandBDBM14027
Substrate/Competitorn/a
Meas. Tech.ChEMBL_607684 (CHEMBL1071706)
IC50 4300±n/a nM
Citation Morwick, TBüttner, FHCywin, CLDahmann, GHickey, EJakes, SKaplita, PKashem, MAKerr, SKugler, SMao, WMarshall, DPaw, ZShih, CKWu, FYoung, E Hit to lead account of the discovery of bisbenzamide and related ureidobenzamide inhibitors of Rho kinase. J Med Chem53:759-77 (2010) 
 
Rho-associated protein kinase 1
Name:Rho-associated protein kinase 1
Type:Serine/threonine-protein kinase
Mol. Mass.:158156.77
Organism:Homo sapiens (Human)
Description:Q13464
Residue:1354
BDBM14027
NameBDBM14027
Synonyms:5-(1,4-diazepan-1-ylsulfonyl)isoquinoline AT877 CHEMBL541388 HA-1077 cid_163751
TypeSmall organic molecule
Emp. Form.C14H17N3O2S
Mol. Mass.291.369
SMILESO=S(=O)(N1CCCNCC1)c1cccc2cnccc12