Reaction Details
TargetRho-associated protein kinase 2
LigandBDBM50308865
Substrate/Competitorn/a
Meas. Tech.ChEMBL_607685 (CHEMBL1071707)
IC50 160000±n/a nM
Citation Morwick, TBüttner, FHCywin, CLDahmann, GHickey, EJakes, SKaplita, PKashem, MAKerr, SKugler, SMao, WMarshall, DPaw, ZShih, CKWu, FYoung, E Hit to lead account of the discovery of bisbenzamide and related ureidobenzamide inhibitors of Rho kinase. J Med Chem53:759-77 (2010) 
 
Rho-associated protein kinase 2
Name:Rho-associated protein kinase 2
Type:Protein
Mol. Mass.:160885.43
Organism:Homo sapiens (Human)
Description:O75116
Residue:1388
BDBM50308865
NameBDBM50308865
Synonyms:CHEMBL589102 | N-[3-(4-Dimethylaminomethyl-phenylcarbamoyl)-benzyl]-4-methoxy-3-trifluoromethyl-benzamide
TypeSmall organic molecule
Emp. Form.C26H26F3N3O3
Mol. Mass.485.4981
SMILESCOc1ccc(cc1C(F)(F)F)C(=O)NCc1cccc(c1)C(=O)Nc1ccc(CN(C)C)cc1