Reaction Details
TargetCytochrome P450 3A4
LigandBDBM50308871
Substrate/Competitorn/a
Meas. Tech.ChEMBL_611722 (CHEMBL1074316)
IC50 8100±n/a nM
Citation Morwick, TBüttner, FHCywin, CLDahmann, GHickey, EJakes, SKaplita, PKashem, MAKerr, SKugler, SMao, WMarshall, DPaw, ZShih, CKWu, FYoung, E Hit to lead account of the discovery of bisbenzamide and related ureidobenzamide inhibitors of Rho kinase. J Med Chem53:759-77 (2010) 
 
Cytochrome P450 3A4
Name:Cytochrome P450 3A4
Type:Enzyme
Mol. Mass.:57349.57
Organism:Homo sapiens (Human)
Description:n/a
Residue:503
BDBM50308871
NameBDBM50308871
Synonyms:CHEMBL599792 | N-[3-(4-Dimethylaminomethyl-phenylcarbamoyl)-benzyl]-3,4-dimethoxy-benzamide
TypeSmall organic molecule
Emp. Form.C26H29N3O4
Mol. Mass.447.5262
SMILESCOc1ccc(cc1OC)C(=O)NCc1cccc(c1)C(=O)Nc1ccc(CN(C)C)cc1